Bananian

compile error (bananian)

0 1120
Hello,
on my bananapi r1 I have a running bananian. I wanted to compile a package, but receives the error:

  1. In file included from /usr/lib/gcc/arm-linux-gnueabihf/4.9/include-fixed/syslimits.h:7:0,
  2.                  from /usr/lib/gcc/arm-linux-gnueabihf/4.9/include-fixed/limits.h:34,
  3.                  from ../minilzo/minilzo.c:45:
  4. /usr/lib/gcc/arm-linux-gnueabihf/4.9/include-fixed/limits.h:168:61: fatal error: limits.h: No such file or directory
  5. #include_next <limits.h>  /* recurse down to the real one */
  6.                                                              ^
  7. compilation terminated.
  8. pages_gen.c:20:19: fatal error: ctype.h: No such file or directory
  9. #include <ctype.h>
  10.                    ^
  11. compilation terminated.
  12. Makefile:25: recipe for target 'pages_gen' failed
  13. make[1]: *** [pages_gen] Error 1
  14. Makefile:361: recipe for target 'all' failed
  15. make: *** [all] Error 2
Copy the Code


I do not quite know where to look for a solution. help anyone?
sorry for my bad english...

You have to log in before you can reply Login | Sign Up

Points Rules